Information card for entry 4089715
Formula | C20 H20 N2 O10 S2 W2 |
Calculated formula | C20 H20 N2 O10 S2 W2 |
SMILES | [W](SC(S[W](C#[O])(C#[O])(C#[O])(C#[O])C#[O])=C(N(CC)CC)N(CC)CC)(C#[O])(C#[O])(C#[O])(C#[O])C#[O] |
Title of publication | Syntheses and Properties of Dinuclear Group 6 Metal Complexes with the Zwitterionic Sulfur Donor Ligand Bis(N,N-diethylamino)carbeniumdithiocarboxylate |
Authors of publication | Sugaya, Tomoaki; Ohba, Takeshi; Sai, Fumiya; Mashima, Shigeru; Fujihara, Takashi; Unoura, Kei; Nagasawa, Akira |
Journal of publication | Organometallics |
Year of publication | 2013 |
Journal volume | 32 |
Journal issue | 12 |
Pages of publication | 3441 |
a | 15.662 ± 0.0009 Å |
b | 9.8692 ± 0.0006 Å |
c | 17.9998 ± 0.0011 Å |
α | 90° |
β | 95.036 ± 0.001° |
γ | 90° |
Cell volume | 2771.5 ± 0.3 Å3 |
Cell temperature | 173 ± 2 K |
Ambient diffraction temperature | 173 ± 2 K |
Number of distinct elements | 6 |
Space group number | 14 |
Hermann-Mauguin space group symbol | P 1 21/c 1 |
Hall space group symbol | -P 2ybc |
Residual factor for all reflections | 0.0419 |
Residual factor for significantly intense reflections | 0.0333 |
Weighted residual factors for significantly intense reflections | 0.0774 |
Weighted residual factors for all reflections included in the refinement | 0.0814 |
Goodness-of-fit parameter for all reflections included in the refinement | 0.925 |
Diffraction radiation wavelength | 0.71073 Å |
Diffraction radiation type | MoKα |