Information card for entry 4089720
Common name | aug2300 |
Formula | C22.5 H58 Cl I Si6 Sn |
Calculated formula | C22.5 H58 Cl I Si6 Sn |
Title of publication | Reactions of a Highly Crowded Cyclic Stannylene with Iodoalkanes, Enones, and Dienes. Inhibition of Nucleophilic Substitution at Tin(IV) Centers |
Authors of publication | Asadi, Ashrafolmolouk; Eaborn, Colin; Hill, Michael S.; Hitchcock, Peter B.; Meehan, Margaret M.; Smith, J. David |
Journal of publication | Organometallics |
Year of publication | 2002 |
Journal volume | 21 |
Journal issue | 12 |
Pages of publication | 2430 |
a | 27.42 ± 0.001 Å |
b | 27.42 ± 0.0009 Å |
c | 9.259 ± 0.0003 Å |
α | 90° |
β | 90° |
γ | 90° |
Cell volume | 6961.4 ± 0.4 Å3 |
Cell temperature | 173 ± 2 K |
Ambient diffraction temperature | 173 ± 2 K |
Number of distinct elements | 6 |
Space group number | 86 |
Hermann-Mauguin space group symbol | P 42/n :2 |
Hall space group symbol | -P 4bc |
Residual factor for all reflections | 0.0897 |
Residual factor for significantly intense reflections | 0.0578 |
Weighted residual factors for significantly intense reflections | 0.1452 |
Weighted residual factors for all reflections included in the refinement | 0.1632 |
Goodness-of-fit parameter for all reflections included in the refinement | 1.028 |
Diffraction radiation probe | x-ray |
Diffraction radiation wavelength | 0.71073 Å |
Diffraction radiation type | MoKα |