Information card for entry 4104603
Formula | C38 B2 F30 K N3 |
Calculated formula | C38 B2 F30 K N3 |
SMILES | [K+].[B]([N]#CN=C=N[B](c1c(c(c(c(c1F)F)F)F)F)(c1c(c(c(c(c1F)F)F)F)F)c1c(c(c(c(c1F)F)F)F)F)(c1c(c(c(c(c1F)F)F)F)F)(c1c(c(c(c(c1F)F)F)F)F)c1c(c(c(c(c1F)F)F)F)F |
Title of publication | Synthesis, Structure, and Bonding of Weakly Coordinating Anions Based on CN Adducts |
Authors of publication | Arne Bernsdorf; Harald Brand; Robert Hellmann; Martin Köckerling; Axel Schulz; Alexander Villinger; Karsten Voss |
Journal of publication | Journal of the American Chemical Society |
Year of publication | 2009 |
Journal volume | 131 |
Pages of publication | 8958 - 8970 |
a | 9.5787 ± 0.0019 Å |
b | 20.267 ± 0.004 Å |
c | 19.729 ± 0.004 Å |
α | 90° |
β | 101.78 ± 0.03° |
γ | 90° |
Cell volume | 3749.4 ± 1.4 Å3 |
Cell temperature | 200 ± 2 K |
Ambient diffraction temperature | 200 ± 2 K |
Number of distinct elements | 5 |
Space group number | 14 |
Hermann-Mauguin space group symbol | P 1 21/c 1 |
Hall space group symbol | -P 2ybc |
Residual factor for all reflections | 0.1376 |
Residual factor for significantly intense reflections | 0.0513 |
Weighted residual factors for significantly intense reflections | 0.0949 |
Weighted residual factors for all reflections included in the refinement | 0.1131 |
Goodness-of-fit parameter for all reflections included in the refinement | 0.927 |
Diffraction radiation wavelength | 0.71073 Å |
Diffraction radiation type | MoKα |