Information card for entry 4104605
Formula | C54 H32 B2 F30 Li N3 O4 |
Calculated formula | C54 H32 B2 F30 Li N3 O4 |
Title of publication | Synthesis, Structure, and Bonding of Weakly Coordinating Anions Based on CN Adducts |
Authors of publication | Arne Bernsdorf; Harald Brand; Robert Hellmann; Martin Köckerling; Axel Schulz; Alexander Villinger; Karsten Voss |
Journal of publication | Journal of the American Chemical Society |
Year of publication | 2009 |
Journal volume | 131 |
Pages of publication | 8958 - 8970 |
a | 9.2529 ± 0.0019 Å |
b | 13.331 ± 0.003 Å |
c | 23.851 ± 0.005 Å |
α | 83.84 ± 0.03° |
β | 82.06 ± 0.03° |
γ | 79.71 ± 0.03° |
Cell volume | 2856.6 ± 1.1 Å3 |
Cell temperature | 173 ± 2 K |
Ambient diffraction temperature | 173 ± 2 K |
Number of distinct elements | 7 |
Space group number | 2 |
Hermann-Mauguin space group symbol | P -1 |
Hall space group symbol | -P 1 |
Residual factor for all reflections | 0.0819 |
Residual factor for significantly intense reflections | 0.044 |
Weighted residual factors for significantly intense reflections | 0.1109 |
Weighted residual factors for all reflections included in the refinement | 0.1223 |
Goodness-of-fit parameter for all reflections included in the refinement | 1.07 |
Diffraction radiation wavelength | 0.71073 Å |
Diffraction radiation type | MoKα |