Information card for entry 4104624
Formula | C62 H72 Au2 F12 N6 P2 |
Calculated formula | C62 H72 Au2 F12 N6 P2 |
Title of publication | Luminescent Cyclometalated N-Heterocyclic Carbene-Containing Organogold(III) Complexes: Synthesis, Characterization, Electrochemistry, and Photophysical Studies |
Authors of publication | Vonika Ka-Man Au; Keith Man-Chung Wong; Nianyong Zhu; Vivian Wing-Wah Yam |
Journal of publication | Journal of the American Chemical Society |
Year of publication | 2009 |
Journal volume | 131 |
Pages of publication | 9076 - 9085 |
a | 12.17 ± 0.002 Å |
b | 21.315 ± 0.004 Å |
c | 27.64 ± 0.005 Å |
α | 90° |
β | 100.98 ± 0.02° |
γ | 90° |
Cell volume | 7039 ± 2 Å3 |
Cell temperature | 301 ± 2 K |
Ambient diffraction temperature | 301 ± 2 K |
Number of distinct elements | 6 |
Space group number | 14 |
Hermann-Mauguin space group symbol | P 1 21/n 1 |
Hall space group symbol | -P 2yn |
Residual factor for all reflections | 0.0939 |
Residual factor for significantly intense reflections | 0.0503 |
Weighted residual factors for significantly intense reflections | 0.1177 |
Weighted residual factors for all reflections included in the refinement | 0.1294 |
Goodness-of-fit parameter for all reflections included in the refinement | 0.941 |
Diffraction radiation wavelength | 0.71073 Å |
Diffraction radiation type | MoKα |