Information card for entry 4106834
Formula | C13 H24 Cl5 N3 O |
Calculated formula | C13 H24 Cl5 N3 O |
Title of publication | Perfectly Alternating Copolymerization of CO2 and Epichlorohydrin Using Cobalt(III)-Based Catalyst Systems |
Authors of publication | Guang-Peng Wu; Sheng-Hsuan Wei; Wei-Min Ren; Xiao-Bing Lu; Tie-Qi Xu; Donald J. Darensbourg |
Journal of publication | Journal of the American Chemical Society |
Year of publication | 2011 |
Journal volume | 133 |
Pages of publication | 15191 - 15199 |
a | 9.6483 ± 0.0005 Å |
b | 11.9539 ± 0.0006 Å |
c | 8.5468 ± 0.0004 Å |
α | 90° |
β | 101.684 ± 0.003° |
γ | 90° |
Cell volume | 965.32 ± 0.08 Å3 |
Cell temperature | 273 ± 2 K |
Ambient diffraction temperature | 273 ± 2 K |
Number of distinct elements | 5 |
Space group number | 7 |
Hermann-Mauguin space group symbol | P 1 c 1 |
Hall space group symbol | P -2yc |
Residual factor for all reflections | 0.0393 |
Residual factor for significantly intense reflections | 0.0381 |
Weighted residual factors for significantly intense reflections | 0.0988 |
Weighted residual factors for all reflections included in the refinement | 0.1002 |
Goodness-of-fit parameter for all reflections included in the refinement | 1.037 |
Diffraction radiation wavelength | 0.71073 Å |
Diffraction radiation type | MoKα |