Information card for entry 4108896
Formula | C125 H101 |
Calculated formula | C125 H101 |
Title of publication | Self-Assembling Fullerenes for Improved Bulk-Heterojunction Photovoltaic Devices |
Authors of publication | Robert D. Kennedy; Alexander L. Ayzner; Darcy D. Wanger; Christopher T Day; Merissa Halim; Saeed I. Khan; Sarah H. Tolbert; Benjamin J. Schwartz; Yves Rubin |
Journal of publication | Journal of the American Chemical Society |
Year of publication | 2008 |
Journal volume | 130 |
Pages of publication | 17290 - 17292 |
a | 21.661 ± 0.003 Å |
b | 22.721 ± 0.004 Å |
c | 17.128 ± 0.003 Å |
α | 90° |
β | 90° |
γ | 90° |
Cell volume | 8430 ± 2 Å3 |
Cell temperature | 100 ± 2 K |
Ambient diffraction temperature | 100 ± 2 K |
Number of distinct elements | 2 |
Space group number | 62 |
Hermann-Mauguin space group symbol | P n m a |
Hall space group symbol | -P 2ac 2n |
Residual factor for all reflections | 0.1241 |
Residual factor for significantly intense reflections | 0.0758 |
Weighted residual factors for significantly intense reflections | 0.1961 |
Weighted residual factors for all reflections included in the refinement | 0.2391 |
Goodness-of-fit parameter for all reflections included in the refinement | 1.021 |
Diffraction radiation wavelength | 0.71073 Å |
Diffraction radiation type | MoKα |