Information card for entry 4108962
Formula | C4 H30 I K2 N2 O24 P8 Pt2 |
Calculated formula | C4 H6 I K2 N2 O24 P8 Pt2 |
Title of publication | Mixed Charge-Ordering State of MMX-Type Quasi-One-Dimensional Iodide-Bridged Platinum Complexes with Binary Countercations |
Authors of publication | Hiroaki Iguchi; Shinya Takaishi; Takashi Kajiwara; Hitoshi Miyasaka; Masahiro Yamashita; Hiroyuki Matsuzaki; Hiroshi Okamoto |
Journal of publication | Journal of the American Chemical Society |
Year of publication | 2008 |
Journal volume | 130 |
Pages of publication | 17668 - 17669 |
a | 13.413 ± 0.0016 Å |
b | 13.413 ± 0.0016 Å |
c | 17.257 ± 0.003 Å |
α | 90° |
β | 90° |
γ | 90° |
Cell volume | 3104.7 ± 0.8 Å3 |
Cell temperature | 100 ± 2 K |
Ambient diffraction temperature | 100 ± 2 K |
Number of distinct elements | 8 |
Space group number | 104 |
Hermann-Mauguin space group symbol | P 4 n c |
Hall space group symbol | P 4 -2n |
Residual factor for all reflections | 0.0305 |
Residual factor for significantly intense reflections | 0.0233 |
Weighted residual factors for significantly intense reflections | 0.056 |
Weighted residual factors for all reflections included in the refinement | 0.0577 |
Goodness-of-fit parameter for all reflections included in the refinement | 0.983 |
Diffraction radiation wavelength | 0.71073 Å |
Diffraction radiation type | MoKα |