Information card for entry 4109986
Formula | C72 H91 O9 P2 Pt2 Ru3 Sn3 |
Calculated formula | C72 H91 O9 P2 Pt2 Ru3 Sn3 |
Title of publication | Synthesis, Characterization, and Electronic Structures of a Series of Two-Dimensional Trimetallic Cluster Complexes, Ru3(CO)9(μ-SnPh2)3[Pt(PBut3)]x, x = 0-3 |
Authors of publication | Richard D. Adams; Burjor Captain; Michael B. Hall; Eszter Trufan; Xinzheng Yang |
Journal of publication | Journal of the American Chemical Society |
Year of publication | 2007 |
Journal volume | 129 |
Pages of publication | 12328 - 12340 |
a | 18.326 ± 0.0008 Å |
b | 18.6782 ± 0.0008 Å |
c | 23.4249 ± 0.001 Å |
α | 90° |
β | 101.171 ± 0.001° |
γ | 90° |
Cell volume | 7866.3 ± 0.6 Å3 |
Cell temperature | 294 ± 2 K |
Ambient diffraction temperature | 294 ± 2 K |
Number of distinct elements | 7 |
Space group number | 14 |
Hermann-Mauguin space group symbol | P 1 21/n 1 |
Hall space group symbol | -P 2yn |
Residual factor for all reflections | 0.088 |
Residual factor for significantly intense reflections | 0.0457 |
Weighted residual factors for significantly intense reflections | 0.1006 |
Weighted residual factors for all reflections included in the refinement | 0.1266 |
Goodness-of-fit parameter for all reflections included in the refinement | 1.018 |
Diffraction radiation wavelength | 0.71073 Å |
Diffraction radiation type | MoKα |