Information card for entry 4111670
Common name | ((Co(tmphen)2)3(Fe(CN)6)2).9H2O |
Chemical name | '((Co(tmphen)2)3(Fe(CN)6)2).9H2O |
Formula | C108 H114 Co3 Fe2 N24 O9 |
Calculated formula | C108 H96 Co3 Fe2 N24 O9 |
Title of publication | A Charge-Transfer-Induced Spin Transition in a Discrete Complex: The Role of Extrinsic Factors in Stabilizing Three Electronic Isomeric Forms of a Cyanide-Bridged Co/Fe Cluster |
Authors of publication | Curtis P. Berlinguette; Alina Dragulescu-Andrasi; Andreas Sieber; Hans-Ulrich Güdel; Catalina Achim; Kim R. Dunbar |
Journal of publication | Journal of the American Chemical Society |
Year of publication | 2005 |
Journal volume | 127 |
Pages of publication | 6766 - 6779 |
a | 18.94 ± 0.01 Å |
b | 24.79 ± 0.02 Å |
c | 24.33 ± 0.01 Å |
α | 90° |
β | 97.77 ± 0.09° |
γ | 90° |
Cell volume | 11319 ± 12 Å3 |
Cell temperature | 30 ± 2 K |
Ambient diffraction temperature | 30 ± 2 K |
Number of distinct elements | 6 |
Space group number | 14 |
Hermann-Mauguin space group symbol | P 1 21/c 1 |
Hall space group symbol | -P 2ybc |
Residual factor for all reflections | 0.2097 |
Residual factor for significantly intense reflections | 0.1255 |
Weighted residual factors for significantly intense reflections | 0.3021 |
Weighted residual factors for all reflections included in the refinement | 0.3514 |
Goodness-of-fit parameter for all reflections included in the refinement | 1.094 |
Diffraction radiation wavelength | 0.71073 Å |
Diffraction radiation type | MoKα |