Information card for entry 4113747
Formula | C56 H78 Li2 O10 |
Calculated formula | C56 H78 Li2 O10 |
Title of publication | Synthesis, Structures, and Conformational Characteristics of Calixarene Monoanions and Dianions |
Authors of publication | Tracy A. Hanna; Lihua Liu; Alfredo M. Angeles-Boza; Xiaodi Kou; C. David Gutsche; Krzysztof Ejsmont; William H. Watson; Lev N. Zakharov; Christopher D. Incarvito; Arnold L. Rheingold |
Journal of publication | Journal of the American Chemical Society |
Year of publication | 2003 |
Journal volume | 125 |
Pages of publication | 6228 - 6238 |
a | 13.668 ± 0.003 Å |
b | 22.379 ± 0.005 Å |
c | 20.881 ± 0.004 Å |
α | 90° |
β | 100.354 ± 0.004° |
γ | 90° |
Cell volume | 6283 ± 2 Å3 |
Cell temperature | 293 ± 2 K |
Ambient diffraction temperature | 293 ± 2 K |
Number of distinct elements | 4 |
Space group number | 14 |
Hermann-Mauguin space group symbol | P 1 21/n 1 |
Hall space group symbol | -P 2yn |
Residual factor for all reflections | 0.1601 |
Residual factor for significantly intense reflections | 0.1052 |
Weighted residual factors for significantly intense reflections | 0.2777 |
Weighted residual factors for all reflections included in the refinement | 0.3187 |
Goodness-of-fit parameter for all reflections included in the refinement | 1.088 |
Diffraction radiation wavelength | 0.71073 Å |
Diffraction radiation type | MoKα |