Information card for entry 4116348
Formula | C6 H16 N10 Ni O6 |
Calculated formula | C12 H32 N20 Ni2 O12 |
Title of publication | Tunable Molecular Distortion in a Nickel Complex Coupled to a Reversible Phase Transition in the Crystalline State |
Authors of publication | Larry R. Falvello; Michael A. Hitchman; Fernando Palacio; Isabel Pascual; Arthur J. Schultz; Horst Stratemeier; Milagros Tomás; Esteban P. Urriolabeitia; Dianna M. Young |
Journal of publication | Journal of the American Chemical Society |
Year of publication | 1999 |
Journal volume | 121 |
Pages of publication | 2808 - 2819 |
a | 12.006 ± 0.002 Å |
b | 7.215 ± 0.002 Å |
c | 15.809 ± 0.003 Å |
α | 90° |
β | 90° |
γ | 90° |
Cell volume | 1369.4 ± 0.5 Å3 |
Cell temperature | 148 ± 2 K |
Ambient diffraction temperature | 148 ± 2 K |
Number of distinct elements | 5 |
Space group number | 63 |
Hermann-Mauguin space group symbol | C m c m |
Hall space group symbol | -C 2c 2 |
Residual factor for all reflections | 0.0784 |
Residual factor for significantly intense reflections | 0.0434 |
Weighted residual factors for significantly intense reflections | 0.0952 |
Weighted residual factors for all reflections included in the refinement | 0.102 |
Goodness-of-fit parameter for all reflections included in the refinement | 1.033 |
Diffraction radiation wavelength | 0.71073 Å |
Diffraction radiation type | MoKα |