Information card for entry 4116825
Common name | pentafluorobenzene |
Chemical name | pentafluorobenzene |
Formula | C6 H F5 |
Calculated formula | C6 H F5 |
SMILES | c1(c(c(c(c(c1)F)F)F)F)F |
Title of publication | C-H...F Interactions in the Crystal Structures of Some Fluorobenzenes |
Authors of publication | Venkat R. Thalladi; Hans-Christoph Weiss; Dieter Bläser; Roland Boese; Ashwini Nangia; Gautam R. Desiraju |
Journal of publication | Journal of the American Chemical Society |
Year of publication | 1998 |
Journal volume | 120 |
Pages of publication | 8702 - 8710 |
a | 12.38 ± 0.003 Å |
b | 9.91 ± 0.002 Å |
c | 9.88 ± 0.002 Å |
α | 90° |
β | 102.5 ± 0.03° |
γ | 90° |
Cell volume | 1183.4 ± 0.5 Å3 |
Cell temperature | 200 ± 2 K |
Ambient diffraction temperature | 200 ± 2 K |
Number of distinct elements | 3 |
Space group number | 14 |
Hermann-Mauguin space group symbol | P 1 21/c 1 |
Hall space group symbol | -P 2ybc |
Residual factor for all reflections | 0.0482 |
Residual factor for significantly intense reflections | 0.0344 |
Weighted residual factors for all reflections | 0.1009 |
Weighted residual factors for significantly intense reflections | 0.0912 |
Goodness-of-fit parameter for all reflections | 1.063 |
Goodness-of-fit parameter for significantly intense reflections | 1.114 |
Diffraction radiation wavelength | 0.71073 Å |
Diffraction radiation type | MoKα |