Information card for entry 4117455
Common name | Sc2C2@C80Ad-B |
Formula | C98.5 H18 Cl2 S Sc2 |
Calculated formula | C98.5 H18 Cl2 S Sc2.001 |
Title of publication | Chemical Understanding of Carbide Cluster Metallofullerenes: A Case Study on Sc2C2@C2v(5)-C80 with Complete X-ray Crystallographic Characterizations |
Authors of publication | Hiroki Kurihara; Xing Lu; Yuko Iiduka; Hidefumi Nikawa; Naomi Mizorogi; Zdenek Slanina; Takahiro Tsuchiya; Shigeru Nagase; Takeshi Akasaka |
Journal of publication | Journal of the American Chemical Society |
Year of publication | 2012 |
Journal volume | 134 |
Pages of publication | 3139 - 3144 |
a | 11.13 ± 0.002 Å |
b | 14.73 ± 0.004 Å |
c | 16.508 ± 0.004 Å |
α | 88.207 ± 0.012° |
β | 74.636 ± 0.011° |
γ | 74.459 ± 0.011° |
Cell volume | 2512 ± 1 Å3 |
Cell temperature | 90 ± 2 K |
Ambient diffraction temperature | 90 ± 2 K |
Number of distinct elements | 5 |
Space group number | 2 |
Hermann-Mauguin space group symbol | P -1 |
Hall space group symbol | -P 1 |
Residual factor for all reflections | 0.1558 |
Residual factor for significantly intense reflections | 0.1185 |
Weighted residual factors for significantly intense reflections | 0.354 |
Weighted residual factors for all reflections included in the refinement | 0.3791 |
Goodness-of-fit parameter for all reflections included in the refinement | 1.436 |
Diffraction radiation wavelength | 1 Å |
Diffraction radiation type | synchrotron |