Information card for entry 4121369
Formula | C32 H38 N2 O5 S |
Calculated formula | C32 H38 N2 O5 S |
SMILES | S(=O)(=O)(c1c(cc(cc1C)C)C)NC[C@]([C@@]1(c2c(N(C(=O)OC(C)(C)C)C1=O)cccc2)C)(c1ccccc1)C |
Title of publication | Asymmetric Substitution at the Tetrasubstituted Chiral Carbon: Catalytic Ring-Opening Alkylation of Racemic 2,2-Disubstituted Aziridines with 3-Substituted Oxindoles |
Authors of publication | Kohsuke Ohmatsu; Yuichiro Ando; Takashi Ooi |
Journal of publication | Journal of the American Chemical Society |
Year of publication | 2013 |
Journal volume | 135 |
Pages of publication | 18706 - 18709 |
a | 6.4319 ± 0.0016 Å |
b | 16.382 ± 0.004 Å |
c | 27.793 ± 0.007 Å |
α | 90° |
β | 90° |
γ | 90° |
Cell volume | 2928.5 ± 1.3 Å3 |
Cell temperature | 293 ± 2 K |
Ambient diffraction temperature | 293 ± 2 K |
Number of distinct elements | 5 |
Space group number | 19 |
Hermann-Mauguin space group symbol | P 21 21 21 |
Hall space group symbol | P 2ac 2ab |
Residual factor for all reflections | 0.1421 |
Residual factor for significantly intense reflections | 0.0933 |
Weighted residual factors for significantly intense reflections | 0.2105 |
Weighted residual factors for all reflections included in the refinement | 0.2481 |
Goodness-of-fit parameter for all reflections included in the refinement | 1.035 |
Diffraction radiation wavelength | 0.71075 Å |
Diffraction radiation type | MoKα |