Information card for entry 4121497
Formula | C22 H20 N O P |
Calculated formula | C22 H20 N O P |
Title of publication | NHC-Cu-Catalyzed Addition of Propargylboron Reagents to Phosphinoylimines. Enantioselective Synthesis of Trimethylsilyl-Substituted Homoallenylamides and Application to the Synthesis of S-(-)-Cyclooroidin. |
Authors of publication | Mszar, Nicholas W.; Haeffner, Fredrik; Hoveyda, Amir H. |
Journal of publication | Journal of the American Chemical Society |
Year of publication | 2014 |
Journal volume | 136 |
Journal issue | 9 |
Pages of publication | 3362 - 3365 |
a | 5.3586 ± 0.0005 Å |
b | 15.5598 ± 0.0015 Å |
c | 21.571 ± 0.002 Å |
α | 90° |
β | 94.462 ± 0.005° |
γ | 90° |
Cell volume | 1793.1 ± 0.3 Å3 |
Cell temperature | 100 ± 2 K |
Ambient diffraction temperature | 100 ± 2 K |
Number of distinct elements | 5 |
Space group number | 4 |
Hermann-Mauguin space group symbol | P 1 21 1 |
Hall space group symbol | P 2yb |
Residual factor for all reflections | 0.0305 |
Residual factor for significantly intense reflections | 0.0297 |
Weighted residual factors for significantly intense reflections | 0.0785 |
Weighted residual factors for all reflections included in the refinement | 0.0791 |
Goodness-of-fit parameter for all reflections included in the refinement | 1.066 |
Diffraction radiation wavelength | 0.71073 Å |
Diffraction radiation type | MoKα |