Information card for entry 4121824
Formula | Na4 Si23 |
Calculated formula | Na4 Si23 |
Title of publication | High-Pressure Synthesis and Structural Characterization of the Type II Clathrate Compound Na30.5Si136 Encapsulating Two Sodium Atoms in the Same Silicon Polyhedral Cages. |
Authors of publication | Yamanaka, Shoji; Komatsu, Masaya; Tanaka, Masashi; Sawa, Hiroshi; Inumaru, Kei |
Journal of publication | Journal of the American Chemical Society |
Year of publication | 2014 |
Journal volume | 136 |
Journal issue | 21 |
Pages of publication | 7717 - 7725 |
a | 10.2004 ± 0.0004 Å |
b | 10.2004 ± 0.0004 Å |
c | 10.2004 ± 0.0004 Å |
α | 90° |
β | 90° |
γ | 90° |
Cell volume | 1061.33 ± 0.07 Å3 |
Cell temperature | 293 K |
Ambient diffraction temperature | 293 K |
Number of distinct elements | 2 |
Space group number | 223 |
Hermann-Mauguin space group symbol | P m -3 n |
Hall space group symbol | -P 4n 2 3 |
Residual factor for all reflections | 0.0316 |
Residual factor for significantly intense reflections | 0.0282 |
Weighted residual factors for significantly intense reflections | 0.0755 |
Weighted residual factors for all reflections included in the refinement | 0.0781 |
Goodness-of-fit parameter for all reflections included in the refinement | 1.053 |
Diffraction radiation probe | x-ray |
Diffraction radiation wavelength | 0.71069 Å |
Diffraction radiation type | MoKα |