Information card for entry 4122847
Formula | C10 H13 N3 |
Calculated formula | C10 H13 N3 |
SMILES | n1(ccc(c(c1=N)C#N)C)CCC |
Title of publication | Ylidenemalononitrile enamines as fluorescent "turn-on" indicators for primary amines. |
Authors of publication | Longstreet, Ashley R.; Jo, Minyoung; Chandler, Rebecca R.; Hanson, Kenneth; Zhan, Naiqian; Hrudka, Jeremy J.; Mattoussi, Hedi; Shatruk, Michael; McQuade, D. Tyler |
Journal of publication | Journal of the American Chemical Society |
Year of publication | 2014 |
Journal volume | 136 |
Journal issue | 44 |
Pages of publication | 15493 - 15496 |
a | 7.7043 ± 0.0009 Å |
b | 15.9073 ± 0.0019 Å |
c | 15.9426 ± 0.0019 Å |
α | 90° |
β | 90° |
γ | 90° |
Cell volume | 1953.8 ± 0.4 Å3 |
Cell temperature | 230 ± 2 K |
Ambient diffraction temperature | 230 ± 2 K |
Number of distinct elements | 3 |
Space group number | 61 |
Hermann-Mauguin space group symbol | P b c a |
Hall space group symbol | -P 2ac 2ab |
Residual factor for all reflections | 0.0493 |
Residual factor for significantly intense reflections | 0.0409 |
Weighted residual factors for significantly intense reflections | 0.1143 |
Weighted residual factors for all reflections included in the refinement | 0.1231 |
Goodness-of-fit parameter for all reflections included in the refinement | 1.011 |
Diffraction radiation wavelength | 0.71073 Å |
Diffraction radiation type | MoKα |