Information card for entry 4125995
Formula | C42 H43 B F10 O3 Zr |
Calculated formula | C42 H43 B F10 O3 Zr |
SMILES | [Zr]12345678(Oc9c(cc(cc9C)C)C)([O]=CO[BH](c9c(F)c(F)c(F)c(F)c9F)c9c(F)c(F)c(F)c(F)c9F)([c]9([c]1([c]2([c]3([c]49C)C)C)C)C)[c]1([c]8([c]7([c]6([c]51C)C)C)C)C |
Title of publication | CO-Reduction Chemistry: Reaction of a CO-Derived Formylhydridoborate with Carbon Monoxide, with Carbon Dioxide, and with Dihydrogen. |
Authors of publication | Jian, Zhongbao; Kehr, Gerald; Daniliuc, Constantin G.; Wibbeling, Birgit; Wiegand, Thomas; Siedow, Melanie; Eckert, Hellmut; Bursch, Markus; Grimme, Stefan; Erker, Gerhard |
Journal of publication | Journal of the American Chemical Society |
Year of publication | 2017 |
a | 16.5662 ± 0.0002 Å |
b | 19.9277 ± 0.0002 Å |
c | 25.6405 ± 0.0003 Å |
α | 90° |
β | 90° |
γ | 90° |
Cell volume | 8464.6 ± 0.17 Å3 |
Cell temperature | 173 ± 2 K |
Ambient diffraction temperature | 173 ± 2 K |
Number of distinct elements | 6 |
Space group number | 61 |
Hermann-Mauguin space group symbol | P b c a |
Hall space group symbol | -P 2ac 2ab |
Residual factor for all reflections | 0.053 |
Residual factor for significantly intense reflections | 0.0406 |
Weighted residual factors for significantly intense reflections | 0.0899 |
Weighted residual factors for all reflections included in the refinement | 0.0958 |
Goodness-of-fit parameter for all reflections included in the refinement | 1.028 |
Diffraction radiation wavelength | 0.71073 Å |
Diffraction radiation type | MoKα |