Information card for entry 4127246
Formula | C17 H18 N2 O3 |
Calculated formula | C17 H18 N2 O3 |
SMILES | O(C(=O)C(=N\Nc1ccc(OC)cc1)/c1ccccc1)CC |
Title of publication | Structure Property Analysis of the Solution and Solid-State Properties of Bistable Photochromic Hydrazones. |
Authors of publication | Shao, Baihao; Qian, Hai; Li, Quan; Aprahamian, Ivan |
Journal of publication | Journal of the American Chemical Society |
Year of publication | 2019 |
Journal volume | 141 |
Journal issue | 20 |
Pages of publication | 8364 - 8371 |
a | 17.0954 ± 0.0016 Å |
b | 12.4698 ± 0.0012 Å |
c | 7.1665 ± 0.0007 Å |
α | 90° |
β | 98.801 ± 0.001° |
γ | 90° |
Cell volume | 1509.7 ± 0.3 Å3 |
Cell temperature | 173 ± 2 K |
Ambient diffraction temperature | 173 ± 2 K |
Number of distinct elements | 4 |
Space group number | 9 |
Hermann-Mauguin space group symbol | C 1 c 1 |
Hall space group symbol | C -2yc |
Residual factor for all reflections | 0.0455 |
Residual factor for significantly intense reflections | 0.0392 |
Weighted residual factors for significantly intense reflections | 0.0919 |
Weighted residual factors for all reflections included in the refinement | 0.0977 |
Goodness-of-fit parameter for all reflections included in the refinement | 1.054 |
Diffraction radiation wavelength | 0.71073 Å |
Diffraction radiation type | MoKα |