Information card for entry 4127282
Formula |
F3 Sc |
Calculated formula |
F3 Sc |
Title of publication |
Zero thermal expansion and ferromagnetism in cubic Sc1-x Mx F3 (M = Ga, Fe) over a wide temperature range |
Authors of publication |
Hu, Lei; Chen, Jun; Fan, Longlong; Ren, Yang; Rong, Yangchun; Pan, Zhao; Deng, Jinxia; Yu, Ranbo; Xing, Xianran |
Journal of publication |
Journal of the American Chemical Society |
Year of publication |
2014 |
Journal volume |
136 |
Journal issue |
39 |
Pages of publication |
13566 - 13569 |
a |
4.01245 ± 0.00007 Å |
b |
4.01245 ± 0.00007 Å |
c |
4.01245 ± 0.00007 Å |
α |
90° |
β |
90° |
γ |
90° |
Cell volume |
64.599 ± 0.002 Å3 |
Cell temperature |
300 K |
Number of distinct elements |
2 |
Space group number |
221 |
Hermann-Mauguin space group symbol |
P m -3 m |
Hall space group symbol |
-P 4 2 3 |
Yes |
No |
No |