Information card for entry 4127285
Formula |
C15 H6 Cu F N O8 |
Calculated formula |
C15 H6 Cu F N O8 |
Title of publication |
Enhanced Gas Uptake in a Microporous Metal-Organic Framework <i>via</i> a Sorbate Induced-Fit Mechanism. |
Authors of publication |
Yu, Mei-Hui; Space, Brian; Franz, Douglas; Zhou, Wei; He, Chaohui; Li, Libo; Krishna, Rajamani; Chang, Ze; Li, Wei; Hu, Tong-Liang; Bu, Xian-He |
Journal of publication |
Journal of the American Chemical Society |
Year of publication |
2019 |
a |
10.557 ± 0.0008 Å |
b |
11.4035 ± 0.0009 Å |
c |
14.3239 ± 0.0012 Å |
α |
90° |
β |
108.725 ± 0.009° |
γ |
90° |
Cell volume |
1633.1 ± 0.2 Å3 |
Cell temperature |
195 K |
Ambient diffraction temperature |
195 K |
Number of distinct elements |
6 |
Space group number |
14 |
Hermann-Mauguin space group symbol |
P 1 21/c 1 |
Hall space group symbol |
-P 2ybc |
Residual factor for all reflections |
0.0939 |
Residual factor for significantly intense reflections |
0.078 |
Weighted residual factors for significantly intense reflections |
0.2068 |
Weighted residual factors for all reflections included in the refinement |
0.2265 |
Goodness-of-fit parameter for all reflections included in the refinement |
1.061 |
Diffraction radiation wavelength |
1.54184 Å |
Diffraction radiation type |
CuKα |
Yes |
No |
No |