Information card for entry 4127356
Formula | C314 H216 Ag12 F60 N82 O48 S22 |
Calculated formula | C308.2 H216 Ag12 F42.6 N79.1 O36.4 S16.2 |
Title of publication | Anion Pairs Template a Trigonal Prism with Disilver Vertices. |
Authors of publication | Carpenter, John P.; McTernan, Charlie T.; Ronson, Tanya K.; Nitschke, Jonathan R. |
Journal of publication | Journal of the American Chemical Society |
Year of publication | 2019 |
Journal volume | 141 |
Journal issue | 29 |
Pages of publication | 11409 - 11413 |
a | 42.8029 ± 0.0007 Å |
b | 32.731 ± 0.0004 Å |
c | 27.8538 ± 0.0005 Å |
α | 90° |
β | 93.412 ± 0.001° |
γ | 90° |
Cell volume | 38953.5 ± 1.1 Å3 |
Cell temperature | 100 ± 2 K |
Ambient diffraction temperature | 100 ± 2 K |
Number of distinct elements | 7 |
Space group number | 15 |
Hermann-Mauguin space group symbol | C 1 2/c 1 |
Hall space group symbol | -C 2yc |
Residual factor for all reflections | 0.1175 |
Residual factor for significantly intense reflections | 0.0872 |
Weighted residual factors for significantly intense reflections | 0.2573 |
Weighted residual factors for all reflections included in the refinement | 0.2907 |
Goodness-of-fit parameter for all reflections included in the refinement | 1.044 |
Diffraction radiation wavelength | 0.6889 Å |
Diffraction radiation type | Synchrotron |