Information card for entry 4127363
Formula | C64 H48 O34 Th6 |
Calculated formula | C64 H48 O34 Th6 |
Title of publication | Thermodynamics and Electronic Properties of Heterometallic Multinuclear Actinide-Containing Metal-Organic Frameworks with "Structural Memory". |
Authors of publication | Ejegbavwo, Otega A.; Martin, Corey R.; Olorunfemi, Oyindamola A.; Leith, Gabrielle A.; Ly, Richard T.; Rice, Allison M.; Dolgopolova, Ekaterina A.; Smith, Mark D.; Karakalos, Stavros G.; Birkner, Nancy; Powell, Brian A.; Pandey, Shubham; Koch, Robert J.; Misture, Scott T.; Loye, Hans-Conrad Zur; Phillpot, Simon R.; Brinkman, Kyle S.; Shustova, Natalia B. |
Journal of publication | Journal of the American Chemical Society |
Year of publication | 2019 |
Journal volume | 141 |
Journal issue | 29 |
Pages of publication | 11628 - 11640 |
a | 25.5223 ± 0.0017 Å |
b | 25.5223 ± 0.0017 Å |
c | 14.6275 ± 0.0011 Å |
α | 90° |
β | 90° |
γ | 90° |
Cell volume | 9528.2 ± 1.1 Å3 |
Cell temperature | 100 ± 2 K |
Ambient diffraction temperature | 100 ± 2 K |
Number of distinct elements | 4 |
Space group number | 131 |
Hermann-Mauguin space group symbol | P 42/m m c |
Hall space group symbol | -P 4c 2 |
Residual factor for all reflections | 0.1223 |
Residual factor for significantly intense reflections | 0.0895 |
Weighted residual factors for significantly intense reflections | 0.2378 |
Weighted residual factors for all reflections included in the refinement | 0.2657 |
Goodness-of-fit parameter for all reflections included in the refinement | 1.049 |
Diffraction radiation probe | x-ray |
Diffraction radiation wavelength | 0.71073 Å |
Diffraction radiation type | MoKα |