Information card for entry 4127370
Formula | C84 H60 F6 O34 U6 |
Calculated formula | C84 H60 F6 O34 U6 |
Title of publication | Thermodynamics and Electronic Properties of Heterometallic Multinuclear Actinide-Containing Metal-Organic Frameworks with "Structural Memory". |
Authors of publication | Ejegbavwo, Otega A.; Martin, Corey R.; Olorunfemi, Oyindamola A.; Leith, Gabrielle A.; Ly, Richard T.; Rice, Allison M.; Dolgopolova, Ekaterina A.; Smith, Mark D.; Karakalos, Stavros G.; Birkner, Nancy; Powell, Brian A.; Pandey, Shubham; Koch, Robert J.; Misture, Scott T.; Loye, Hans-Conrad Zur; Phillpot, Simon R.; Brinkman, Kyle S.; Shustova, Natalia B. |
Journal of publication | Journal of the American Chemical Society |
Year of publication | 2019 |
Journal volume | 141 |
Journal issue | 29 |
Pages of publication | 11628 - 11640 |
a | 23.6374 ± 0.001 Å |
b | 23.6374 ± 0.001 Å |
c | 19.3363 ± 0.0009 Å |
α | 90° |
β | 90° |
γ | 90° |
Cell volume | 10803.7 ± 0.8 Å3 |
Cell temperature | 100 ± 2 K |
Ambient diffraction temperature | 100 ± 2 K |
Number of distinct elements | 5 |
Space group number | 131 |
Hermann-Mauguin space group symbol | P 42/m m c |
Hall space group symbol | -P 4c 2 |
Residual factor for all reflections | 0.0671 |
Residual factor for significantly intense reflections | 0.048 |
Weighted residual factors for significantly intense reflections | 0.1233 |
Weighted residual factors for all reflections included in the refinement | 0.1359 |
Goodness-of-fit parameter for all reflections included in the refinement | 1.035 |
Diffraction radiation probe | x-ray |
Diffraction radiation wavelength | 0.71073 Å |
Diffraction radiation type | MoKα |