Information card for entry 4127412
Formula | C39.87 H53.87 Cl2.62 N O4 |
Calculated formula | C39.874 H53.874 Cl2.622 N O4 |
Title of publication | Regiodivergent Photocyclization of Dearomatized Acylphloroglucinols: Asymmetric Syntheses of (-)-Nemorosone and (-)-6-<i>epi</i>-Garcimultiflorone A. |
Authors of publication | Wen, Saishuai; Boyce, Jonathan H.; Kandappa, Sunil K.; Sivaguru, Jayaraman; Porco, Jr, John A |
Journal of publication | Journal of the American Chemical Society |
Year of publication | 2019 |
Journal volume | 141 |
Journal issue | 28 |
Pages of publication | 11315 - 11321 |
a | 10.3691 ± 0.0005 Å |
b | 17.1035 ± 0.0008 Å |
c | 11.0229 ± 0.0005 Å |
α | 90° |
β | 97.966 ± 0.002° |
γ | 90° |
Cell volume | 1936.02 ± 0.16 Å3 |
Cell temperature | 296 ± 2 K |
Ambient diffraction temperature | 296.15 K |
Number of distinct elements | 5 |
Space group number | 4 |
Hermann-Mauguin space group symbol | P 1 21 1 |
Hall space group symbol | P 2yb |
Residual factor for all reflections | 0.0437 |
Residual factor for significantly intense reflections | 0.042 |
Weighted residual factors for significantly intense reflections | 0.1177 |
Weighted residual factors for all reflections included in the refinement | 0.1193 |
Goodness-of-fit parameter for all reflections included in the refinement | 1.04 |
Diffraction radiation wavelength | 1.54178 Å |
Diffraction radiation type | CuKα |