Information card for entry 4127488
Formula | C4 H9 Cl3 F Mn N |
Calculated formula | C4 H9 Cl3 F Mn N |
Title of publication | Fluorine Substitution Induced High T<sub>c</sub> of Enantiomeric Perovskite Ferroelectrics: ( R) - and ( S) -3-(Fluoropyrrolidinium)MnCl<sub>3</sub>. |
Authors of publication | Ai, Yong; Chen, Xiao-Gang; Shi, Ping-Ping; Tang, Yuan-Yuan; Li, Peng-Fei; Liao, Wei-Qiang; Xiong, Ren-Gen |
Journal of publication | Journal of the American Chemical Society |
Year of publication | 2019 |
Journal volume | 141 |
Journal issue | 10 |
Pages of publication | 4474 - 4479 |
a | 7.622 ± 0.0005 Å |
b | 6.488 ± 0.0003 Å |
c | 9.5948 ± 0.0007 Å |
α | 90° |
β | 112.474 ± 0.008° |
γ | 90° |
Cell volume | 438.44 ± 0.05 Å3 |
Cell temperature | 298 ± 2 K |
Ambient diffraction temperature | 298 ± 2 K |
Number of distinct elements | 6 |
Space group number | 4 |
Hermann-Mauguin space group symbol | P 1 21 1 |
Hall space group symbol | P 2yb |
Residual factor for all reflections | 0.0457 |
Residual factor for significantly intense reflections | 0.044 |
Weighted residual factors for significantly intense reflections | 0.1317 |
Weighted residual factors for all reflections included in the refinement | 0.1344 |
Goodness-of-fit parameter for all reflections included in the refinement | 1.158 |
Diffraction radiation wavelength | 0.71073 Å |
Diffraction radiation type | MoKα |