Information card for entry 4127559
Formula | C19 H14 B F9 N6 Ni |
Calculated formula | C19 H14 B F9 N6 Ni |
SMILES | [Ni]123([n]4n(ccc4)[BH](n4[n]1ccc4)n1[n]2ccc1)(c1ccc(F)cc1)C(F)(F)C(F)(F)C(F)(F)C3(F)F |
Title of publication | Connecting Organometallic Ni(III) and Ni(IV): Reactions of Carbon-Centered Radicals with High-Valent Organonickel Complexes. |
Authors of publication | Bour, James R.; Ferguson, Devin M.; McClain, Edward J.; Kampf, Jeff W.; Sanford, Melanie S. |
Journal of publication | Journal of the American Chemical Society |
Year of publication | 2019 |
Journal volume | 141 |
Journal issue | 22 |
Pages of publication | 8914 - 8920 |
a | 9.5099 ± 0.0003 Å |
b | 9.9578 ± 0.0003 Å |
c | 12.0931 ± 0.0003 Å |
α | 98.118 ± 0.002° |
β | 92.716 ± 0.002° |
γ | 106.997 ± 0.003° |
Cell volume | 1079.43 ± 0.06 Å3 |
Cell temperature | 85 ± 2 K |
Ambient diffraction temperature | 85 ± 2 K |
Number of distinct elements | 6 |
Space group number | 2 |
Hermann-Mauguin space group symbol | P -1 |
Hall space group symbol | -P 1 |
Residual factor for all reflections | 0.0457 |
Residual factor for significantly intense reflections | 0.0439 |
Weighted residual factors for significantly intense reflections | 0.1189 |
Weighted residual factors for all reflections included in the refinement | 0.1214 |
Goodness-of-fit parameter for all reflections included in the refinement | 1.031 |
Diffraction radiation wavelength | 1.54184 Å |
Diffraction radiation type | CuKα |