Information card for entry 4127588
Formula | C70 H56 F20 N4 O3 Ru |
Calculated formula | C70 H56 F20 N4 O3 Ru |
Title of publication | Ruthenium(II) Porphyrin Quinoid Carbene Complexes: Synthesis, Crystal Structure, and Reactivity toward Carbene Transfer and Hydrogen Atom Transfer Reactions. |
Authors of publication | Wang, Hai-Xu; Wan, Qingyun; Wu, Kai; Low, Kam-Hung; Yang, Chen; Zhou, Cong-Ying; Huang, Jie-Sheng; Che, Chi-Ming |
Journal of publication | Journal of the American Chemical Society |
Year of publication | 2019 |
Journal volume | 141 |
Journal issue | 22 |
Pages of publication | 9027 - 9046 |
a | 13.106 ± 0.0006 Å |
b | 19.2811 ± 0.0011 Å |
c | 25.7572 ± 0.0014 Å |
α | 90° |
β | 97.696 ± 0.002° |
γ | 90° |
Cell volume | 6450.2 ± 0.6 Å3 |
Cell temperature | 151 ± 2 K |
Ambient diffraction temperature | 151 ± 2 K |
Number of distinct elements | 6 |
Space group number | 14 |
Hermann-Mauguin space group symbol | P 1 21/c 1 |
Hall space group symbol | -P 2ybc |
Residual factor for all reflections | 0.0632 |
Residual factor for significantly intense reflections | 0.0395 |
Weighted residual factors for significantly intense reflections | 0.0746 |
Weighted residual factors for all reflections included in the refinement | 0.0829 |
Goodness-of-fit parameter for all reflections included in the refinement | 1.023 |
Diffraction radiation wavelength | 0.71073 Å |
Diffraction radiation type | MoKα |