Information card for entry 4127622
Formula | C54 H69 B3 N4 O2 |
Calculated formula | C54 H69 B3 N4 O2 |
SMILES | [BH]([B](B1Oc2c(O1)cccc2)=C1N(CCN1c1c(cccc1C(C)C)C(C)C)c1c(cc(cc1C)C)C)=C1N(CCN1c1c(cccc1C(C)C)C(C)C)c1c(cc(cc1C)C)C |
Title of publication | Single and Double Hydroboration of B-B Triple Bonds and Convergent Routes to a Cationic Tetraborane. |
Authors of publication | Brückner, Tobias; Stennett, Tom E.; Heß, Merlin; Braunschweig, Holger |
Journal of publication | Journal of the American Chemical Society |
Year of publication | 2019 |
Journal volume | 141 |
Journal issue | 37 |
Pages of publication | 14898 - 14903 |
a | 19.5024 ± 0.0006 Å |
b | 11.4232 ± 0.0003 Å |
c | 23.203 ± 0.0007 Å |
α | 90° |
β | 110.981 ± 0.001° |
γ | 90° |
Cell volume | 4826.4 ± 0.2 Å3 |
Cell temperature | 100 ± 2 K |
Ambient diffraction temperature | 100 ± 2 K |
Number of distinct elements | 5 |
Space group number | 14 |
Hermann-Mauguin space group symbol | P 1 21/c 1 |
Hall space group symbol | -P 2ybc |
Residual factor for all reflections | 0.0536 |
Residual factor for significantly intense reflections | 0.0403 |
Weighted residual factors for significantly intense reflections | 0.0962 |
Weighted residual factors for all reflections included in the refinement | 0.1063 |
Goodness-of-fit parameter for all reflections included in the refinement | 1.042 |
Diffraction radiation wavelength | 0.71073 Å |
Diffraction radiation type | MoKα |