Information card for entry 4127639
Formula | C76 H78 Cl4 N2 Ru2 |
Calculated formula | C76 H78 Cl4 N2 Ru2 |
Title of publication | Integrating Activity with Accessibility in Olefin Metathesis: An Unprecedentedly Reactive Ruthenium-Indenylidene Catalyst. |
Authors of publication | Nascimento, Daniel L.; Gawin, Anna; Gawin, Rafał; Guńka, Piotr A; Zachara, Janusz; Skowerski, Krzysztof; Fogg, Deryn E. |
Journal of publication | Journal of the American Chemical Society |
Year of publication | 2019 |
Journal volume | 141 |
Journal issue | 27 |
Pages of publication | 10626 - 10631 |
a | 20.2004 ± 0.0007 Å |
b | 13.0402 ± 0.0004 Å |
c | 27.5306 ± 0.0008 Å |
α | 90° |
β | 105.534 ± 0.003° |
γ | 90° |
Cell volume | 6987.1 ± 0.4 Å3 |
Cell temperature | 293 ± 2 K |
Ambient diffraction temperature | 293.15 K |
Number of distinct elements | 5 |
Space group number | 14 |
Hermann-Mauguin space group symbol | P 1 21/n 1 |
Hall space group symbol | -P 2yn |
Residual factor for all reflections | 0.1068 |
Residual factor for significantly intense reflections | 0.0502 |
Weighted residual factors for significantly intense reflections | 0.0875 |
Weighted residual factors for all reflections included in the refinement | 0.1055 |
Goodness-of-fit parameter for all reflections included in the refinement | 0.962 |
Diffraction radiation probe | x-ray |
Diffraction radiation wavelength | 0.71073 Å |
Diffraction radiation type | MoKα |