Information card for entry 4127642
Formula | C9 H38 I13 N5 Pb4 |
Calculated formula | C9 H38 I13 N5 Pb4 |
Title of publication | From 2D to 1D Electronic Dimensionality in Halide Perovskites with Stepped and Flat Layers Using Propylammonium as a Spacer. |
Authors of publication | Hoffman, Justin M.; Che, Xiaoyang; Sidhik, Siraj; Li, Xiaotong; Hadar, Ido; Blancon, Jean-Christophe; Yamaguchi, Hisato; Kepenekian, Mikaël; Katan, Claudine; Even, Jacky; Stoumpos, Constantinos C.; Mohite, Aditya D.; Kanatzidis, Mercouri G. |
Journal of publication | Journal of the American Chemical Society |
Year of publication | 2019 |
Journal volume | 141 |
Journal issue | 27 |
Pages of publication | 10661 - 10676 |
a | 62.405 ± 0.005 Å |
b | 8.9358 ± 0.0007 Å |
c | 8.8712 ± 0.0006 Å |
α | 90° |
β | 92.947 ± 0.006° |
γ | 90° |
Cell volume | 4940.4 ± 0.6 Å3 |
Cell temperature | 293 K |
Ambient diffraction temperature | 293 K |
Number of distinct elements | 5 |
Space group number | 9 |
Hermann-Mauguin space group symbol | C 1 c 1 |
Hall space group symbol | C -2yc |
Residual factor for all reflections | 0.2447 |
Residual factor for significantly intense reflections | 0.1161 |
Weighted residual factors for significantly intense reflections | 0.2277 |
Weighted residual factors for all reflections included in the refinement | 0.246 |
Goodness-of-fit parameter for significantly intense reflections | 4.44 |
Goodness-of-fit parameter for all reflections included in the refinement | 2.62 |
Diffraction radiation probe | x-ray |
Diffraction radiation wavelength | 0.71073 Å |
Diffraction radiation type | MoKα |