Information card for entry 4127644
Formula | C24 H80 I18 N8 Pb5 |
Calculated formula | C24 H79 I18 N8 Pb5 |
Title of publication | From 2D to 1D Electronic Dimensionality in Halide Perovskites with Stepped and Flat Layers Using Propylammonium as a Spacer. |
Authors of publication | Hoffman, Justin M.; Che, Xiaoyang; Sidhik, Siraj; Li, Xiaotong; Hadar, Ido; Blancon, Jean-Christophe; Yamaguchi, Hisato; Kepenekian, Mikaël; Katan, Claudine; Even, Jacky; Stoumpos, Constantinos C.; Mohite, Aditya D.; Kanatzidis, Mercouri G. |
Journal of publication | Journal of the American Chemical Society |
Year of publication | 2019 |
Journal volume | 141 |
Journal issue | 27 |
Pages of publication | 10661 - 10676 |
a | 24.1035 ± 0.0005 Å |
b | 8.798 ± 0.0002 Å |
c | 38.1538 ± 0.0008 Å |
α | 90° |
β | 94.4517 ± 0.0012° |
γ | 90° |
Cell volume | 8066.6 ± 0.3 Å3 |
Cell temperature | 293 K |
Ambient diffraction temperature | 293 K |
Number of distinct elements | 5 |
Space group number | 13 |
Hermann-Mauguin space group symbol | P 1 2/c 1 |
Hall space group symbol | -P 2yc |
Residual factor for all reflections | 0.054 |
Residual factor for significantly intense reflections | 0.0415 |
Weighted residual factors for significantly intense reflections | 0.1092 |
Weighted residual factors for all reflections included in the refinement | 0.1145 |
Goodness-of-fit parameter for significantly intense reflections | 3.1 |
Goodness-of-fit parameter for all reflections included in the refinement | 2.92 |
Diffraction radiation probe | x-ray |
Diffraction radiation wavelength | 0.71073 Å |
Diffraction radiation type | MoKα |