Information card for entry 4127661
Formula | C70.5 H72 Cl0.5 F16.5 O18.5 Ru3 S5.5 |
Calculated formula | C70.5 H72 Cl0.5 F16.5 O18.5 Ru3 S5.5 |
Title of publication | π-Metalated [1<sub>5</sub>]Paracyclophanes: Synthesis and Binding to Oxo-Anions via Anion-π Interactions. |
Authors of publication | Zeng, Hong; Liu, Peiren; Feng, Guoqin; Huang, Feihe |
Journal of publication | Journal of the American Chemical Society |
Year of publication | 2019 |
Journal volume | 141 |
Journal issue | 41 |
Pages of publication | 16501 - 16511 |
a | 16.2763 ± 0.0006 Å |
b | 22.5468 ± 0.0007 Å |
c | 24.1052 ± 0.0008 Å |
α | 90° |
β | 90° |
γ | 90° |
Cell volume | 8846.1 ± 0.5 Å3 |
Cell temperature | 170 ± 2 K |
Ambient diffraction temperature | 169.99 K |
Number of distinct elements | 7 |
Space group number | 62 |
Hermann-Mauguin space group symbol | P n m a |
Hall space group symbol | -P 2ac 2n |
Residual factor for all reflections | 0.0709 |
Residual factor for significantly intense reflections | 0.0648 |
Weighted residual factors for significantly intense reflections | 0.1961 |
Weighted residual factors for all reflections included in the refinement | 0.2037 |
Goodness-of-fit parameter for all reflections included in the refinement | 1.027 |
Diffraction radiation wavelength | 1.34139 Å |
Diffraction radiation type | GaKα |