Information card for entry 4127666
Formula | C20 H20 N2 O5 S |
Calculated formula | C20 H20 N2 O5 S |
SMILES | S1(=O)(=O)c2c(cccc2)C(O)N1c1cc2c(oc1=O)cc(cc2)N(CC)CC |
Title of publication | Dynamic Covalent Switches and Communicating Networks for Tunable Multicolor Luminescent Systems and Vapor-Responsive Materials. |
Authors of publication | Zou, Hanxun; Hai, Yu; Ye, Hebo; You, Lei |
Journal of publication | Journal of the American Chemical Society |
Year of publication | 2019 |
Journal volume | 141 |
Journal issue | 41 |
Pages of publication | 16344 - 16353 |
a | 8.963 ± 0.005 Å |
b | 12.759 ± 0.007 Å |
c | 17.763 ± 0.01 Å |
α | 91.17 ± 0.007° |
β | 95.778 ± 0.006° |
γ | 99.491 ± 0.01° |
Cell volume | 1992 ± 1.9 Å3 |
Cell temperature | 293 ± 2 K |
Ambient diffraction temperature | 293 ± 2 K |
Number of distinct elements | 5 |
Space group number | 2 |
Hermann-Mauguin space group symbol | P -1 |
Hall space group symbol | -P 1 |
Residual factor for all reflections | 0.1555 |
Residual factor for significantly intense reflections | 0.0897 |
Weighted residual factors for significantly intense reflections | 0.2049 |
Weighted residual factors for all reflections included in the refinement | 0.2396 |
Goodness-of-fit parameter for all reflections included in the refinement | 1.114 |
Diffraction radiation wavelength | 0.71073 Å |
Diffraction radiation type | MoKα |