Information card for entry 4127672
Formula | C143 H130 I12 N24 O10 Zn6 |
Calculated formula | C143 H130 I12 N24 O10 Zn6 |
Title of publication | Multiple Absolute Stereocontrol in Cascade Lactone Formation via Dynamic Kinetic Resolution Driven by the Asymmetric Transfer Hydrogenation of Keto Acids with Oxo-Tethered Ruthenium Catalysts. |
Authors of publication | Touge, Taichiro; Sakaguchi, Kazuhiko; Tamaki, Nao; Nara, Hideki; Yokozawa, Tohru; Matsumura, Kazuhiko; Kayaki, Yoshihito |
Journal of publication | Journal of the American Chemical Society |
Year of publication | 2019 |
Journal volume | 141 |
Journal issue | 41 |
Pages of publication | 16354 - 16361 |
a | 36.2576 ± 0.0004 Å |
b | 14.34286 ± 0.00013 Å |
c | 34.8216 ± 0.0004 Å |
α | 90° |
β | 108.398 ± 0.0011° |
γ | 90° |
Cell volume | 17183 ± 0.3 Å3 |
Cell temperature | 100.01 ± 0.1 K |
Ambient diffraction temperature | 100.01 ± 0.1 K |
Number of distinct elements | 6 |
Space group number | 5 |
Hermann-Mauguin space group symbol | C 1 2 1 |
Hall space group symbol | C 2y |
Residual factor for all reflections | 0.075 |
Residual factor for significantly intense reflections | 0.0733 |
Weighted residual factors for significantly intense reflections | 0.2075 |
Weighted residual factors for all reflections included in the refinement | 0.2096 |
Goodness-of-fit parameter for all reflections included in the refinement | 1.083 |
Diffraction radiation wavelength | 1.54184 Å |
Diffraction radiation type | CuKα |