Information card for entry 4127676
Chemical name | (1R,3aR,9bS)-1-methyl-3a,4,5,9b-tetrahydronaphtho[2,1-b]furan-2(1H)-one |
Formula | C13 H14 O2 |
Calculated formula | C13 H14 O2 |
SMILES | O1C(=O)[C@@H]([C@H]2c3ccccc3CC[C@@H]12)C |
Title of publication | Multiple Absolute Stereocontrol in Cascade Lactone Formation via Dynamic Kinetic Resolution Driven by the Asymmetric Transfer Hydrogenation of Keto Acids with Oxo-Tethered Ruthenium Catalysts. |
Authors of publication | Touge, Taichiro; Sakaguchi, Kazuhiko; Tamaki, Nao; Nara, Hideki; Yokozawa, Tohru; Matsumura, Kazuhiko; Kayaki, Yoshihito |
Journal of publication | Journal of the American Chemical Society |
Year of publication | 2019 |
Journal volume | 141 |
Journal issue | 41 |
Pages of publication | 16354 - 16361 |
a | 7.7957 ± 0.0001 Å |
b | 13.9632 ± 0.0002 Å |
c | 9.8653 ± 0.0002 Å |
α | 90° |
β | 106.276 ± 0.002° |
γ | 90° |
Cell volume | 1030.83 ± 0.03 Å3 |
Cell temperature | 99.98 ± 0.1 K |
Ambient diffraction temperature | 99.98 ± 0.1 K |
Number of distinct elements | 3 |
Space group number | 4 |
Hermann-Mauguin space group symbol | P 1 21 1 |
Hall space group symbol | P 2yb |
Residual factor for all reflections | 0.0442 |
Residual factor for significantly intense reflections | 0.0431 |
Weighted residual factors for significantly intense reflections | 0.114 |
Weighted residual factors for all reflections included in the refinement | 0.1159 |
Goodness-of-fit parameter for all reflections included in the refinement | 1.025 |
Diffraction radiation probe | x-ray |
Diffraction radiation wavelength | 1.54184 Å |
Diffraction radiation type | CuKα |