Information card for entry 4127679
Chemical name | (3aS,9bR)-8-chloro-3a,4,5,9b-tetrahydronaphtho[1,2-b]furan-2(3H)-one |
Formula | C12 H11 Cl O2 |
Calculated formula | C12 H11 Cl O2 |
SMILES | Clc1cc2c(cc1)CC[C@@H]1[C@H]2OC(=O)C1 |
Title of publication | Multiple Absolute Stereocontrol in Cascade Lactone Formation via Dynamic Kinetic Resolution Driven by the Asymmetric Transfer Hydrogenation of Keto Acids with Oxo-Tethered Ruthenium Catalysts. |
Authors of publication | Touge, Taichiro; Sakaguchi, Kazuhiko; Tamaki, Nao; Nara, Hideki; Yokozawa, Tohru; Matsumura, Kazuhiko; Kayaki, Yoshihito |
Journal of publication | Journal of the American Chemical Society |
Year of publication | 2019 |
Journal volume | 141 |
Journal issue | 41 |
Pages of publication | 16354 - 16361 |
a | 4.9886 ± 0.0001 Å |
b | 7.7361 ± 0.0001 Å |
c | 26.4469 ± 0.0004 Å |
α | 90° |
β | 90° |
γ | 90° |
Cell volume | 1020.65 ± 0.03 Å3 |
Cell temperature | 99.99 ± 0.1 K |
Ambient diffraction temperature | 99.99 ± 0.1 K |
Number of distinct elements | 4 |
Space group number | 19 |
Hermann-Mauguin space group symbol | P 21 21 21 |
Hall space group symbol | P 2ac 2ab |
Residual factor for all reflections | 0.0335 |
Residual factor for significantly intense reflections | 0.0322 |
Weighted residual factors for significantly intense reflections | 0.102 |
Weighted residual factors for all reflections included in the refinement | 0.1057 |
Goodness-of-fit parameter for all reflections included in the refinement | 0.94 |
Diffraction radiation probe | x-ray |
Diffraction radiation wavelength | 1.54184 Å |
Diffraction radiation type | CuKα |