Information card for entry 4127685
Formula | C32 H50 N2 O2 P2 Ru |
Calculated formula | C32 H50 N2 O2 P2 Ru |
SMILES | [RuH]123([P](C(c4[n]2c(ccc4)C[P]1(C(C)(C)C)C(C)(C)C)C(=O)N3Cc1ccccc1)(C(C)(C)C)C(C)(C)C)C#[O] |
Title of publication | Formamides as Isocyanate Surrogates: A Mechanistically Driven Approach to the Development of Atom-Efficient, Selective Catalytic Syntheses of Ureas, Carbamates, and Heterocycles. |
Authors of publication | Bruffaerts, Jeffrey; von Wolff, Niklas; Diskin-Posner, Yael; Ben-David, Yehoshoa; Milstein, David |
Journal of publication | Journal of the American Chemical Society |
Year of publication | 2019 |
Journal volume | 141 |
Journal issue | 41 |
Pages of publication | 16486 - 16493 |
a | 19.5466 ± 0.0009 Å |
b | 10.6601 ± 0.0003 Å |
c | 16.5688 ± 0.0007 Å |
α | 90° |
β | 112.086 ± 0.005° |
γ | 90° |
Cell volume | 3199.1 ± 0.2 Å3 |
Cell temperature | 100 ± 2 K |
Ambient diffraction temperature | 100 ± 2 K |
Number of distinct elements | 6 |
Space group number | 14 |
Hermann-Mauguin space group symbol | P 1 21/c 1 |
Hall space group symbol | -P 2ybc |
Residual factor for all reflections | 0.0272 |
Residual factor for significantly intense reflections | 0.0218 |
Weighted residual factors for significantly intense reflections | 0.0508 |
Weighted residual factors for all reflections included in the refinement | 0.0524 |
Goodness-of-fit parameter for all reflections included in the refinement | 1.032 |
Diffraction radiation wavelength | 0.71073 Å |
Diffraction radiation type | MoKα |