Information card for entry 4127710
Formula | C15 H14 N2 O3 |
Calculated formula | C15 H14 N2 O3 |
SMILES | O=C1N(C(=O)[C@@H]2[C@H]1[C@H]1C[C@@H]2C=C1)c1c(=O)n(ccc1)C |
Title of publication | Electrostatically Driven CO-π Aromatic Interactions. |
Authors of publication | Li, Ping; Vik, Erik C.; Maier, Josef M.; Karki, Ishwor; Strickland, Sharon M. S.; Umana, Jessica M.; Smith, Mark D.; Pellechia, Perry J.; Shimizu, Ken D. |
Journal of publication | Journal of the American Chemical Society |
Year of publication | 2019 |
Journal volume | 141 |
Journal issue | 32 |
Pages of publication | 12513 - 12517 |
a | 9.9503 ± 0.0008 Å |
b | 10.9577 ± 0.0009 Å |
c | 12.3212 ± 0.001 Å |
α | 70.675 ± 0.002° |
β | 89.261 ± 0.003° |
γ | 85.871 ± 0.003° |
Cell volume | 1264.34 ± 0.18 Å3 |
Cell temperature | 100 ± 2 K |
Ambient diffraction temperature | 100 ± 2 K |
Number of distinct elements | 4 |
Space group number | 2 |
Hermann-Mauguin space group symbol | P -1 |
Hall space group symbol | -P 1 |
Residual factor for all reflections | 0.0495 |
Residual factor for significantly intense reflections | 0.0405 |
Weighted residual factors for significantly intense reflections | 0.1021 |
Weighted residual factors for all reflections included in the refinement | 0.1075 |
Goodness-of-fit parameter for all reflections included in the refinement | 1.022 |
Diffraction radiation probe | x-ray |
Diffraction radiation wavelength | 0.71073 Å |
Diffraction radiation type | MoKα |