Information card for entry 4127714
Formula | C24 H10 F8 N2 O3 |
Calculated formula | C24 H10 F8 N2 O3 |
SMILES | Fc1c2C3[C@H]4[C@@H](C(c2c(F)c(F)c1F)c1c(F)c(F)c(F)c(F)c31)C(=O)N(C4=O)c1c(=O)n(ccc1)C |
Title of publication | Electrostatically Driven CO-π Aromatic Interactions. |
Authors of publication | Li, Ping; Vik, Erik C.; Maier, Josef M.; Karki, Ishwor; Strickland, Sharon M. S.; Umana, Jessica M.; Smith, Mark D.; Pellechia, Perry J.; Shimizu, Ken D. |
Journal of publication | Journal of the American Chemical Society |
Year of publication | 2019 |
Journal volume | 141 |
Journal issue | 32 |
Pages of publication | 12513 - 12517 |
a | 7.7824 ± 0.0004 Å |
b | 8.798 ± 0.0005 Å |
c | 15.0204 ± 0.0008 Å |
α | 90.548 ± 0.002° |
β | 97.632 ± 0.002° |
γ | 98.051 ± 0.002° |
Cell volume | 1008.87 ± 0.09 Å3 |
Cell temperature | 100 ± 2 K |
Ambient diffraction temperature | 100 ± 2 K |
Number of distinct elements | 5 |
Space group number | 2 |
Hermann-Mauguin space group symbol | P -1 |
Hall space group symbol | -P 1 |
Residual factor for all reflections | 0.0461 |
Residual factor for significantly intense reflections | 0.0382 |
Weighted residual factors for significantly intense reflections | 0.1024 |
Weighted residual factors for all reflections included in the refinement | 0.1071 |
Goodness-of-fit parameter for all reflections included in the refinement | 1.042 |
Diffraction radiation probe | x-ray |
Diffraction radiation wavelength | 0.71073 Å |
Diffraction radiation type | MoKα |