Information card for entry 4127717
Formula | C26 H15 F4 N O3 |
Calculated formula | C26 H15 F4 N O3 |
SMILES | Fc1cc2C3[C@H]4[C@@H](C(c2cc1F)c1cc(F)c(F)cc31)C(=O)N(C4=O)c1c2OCCc2ccc1 |
Title of publication | Electrostatically Driven CO-π Aromatic Interactions. |
Authors of publication | Li, Ping; Vik, Erik C.; Maier, Josef M.; Karki, Ishwor; Strickland, Sharon M. S.; Umana, Jessica M.; Smith, Mark D.; Pellechia, Perry J.; Shimizu, Ken D. |
Journal of publication | Journal of the American Chemical Society |
Year of publication | 2019 |
Journal volume | 141 |
Journal issue | 32 |
Pages of publication | 12513 - 12517 |
a | 8.3012 ± 0.0003 Å |
b | 13.3693 ± 0.0006 Å |
c | 17.8245 ± 0.0007 Å |
α | 90° |
β | 90° |
γ | 90° |
Cell volume | 1978.18 ± 0.14 Å3 |
Cell temperature | 100 ± 2 K |
Ambient diffraction temperature | 100 ± 2 K |
Number of distinct elements | 5 |
Space group number | 19 |
Hermann-Mauguin space group symbol | P 21 21 21 |
Hall space group symbol | P 2ac 2ab |
Residual factor for all reflections | 0.0434 |
Residual factor for significantly intense reflections | 0.0354 |
Weighted residual factors for significantly intense reflections | 0.0787 |
Weighted residual factors for all reflections included in the refinement | 0.0821 |
Goodness-of-fit parameter for all reflections included in the refinement | 1.047 |
Diffraction radiation probe | x-ray |
Diffraction radiation wavelength | 0.71073 Å |
Diffraction radiation type | MoKα |