Information card for entry 4127724
Formula | C9 H28 I13 N5 Pb4 |
Calculated formula | C9 H28 I13 N5 Pb4 |
Title of publication | Two-Dimensional Dion-Jacobson Hybrid Lead Iodide Perovskites with Aromatic Diammonium Cations. |
Authors of publication | Li, Xiaotong; Ke, Weijun; Traoré, Boubacar; Guo, Peijun; Hadar, Ido; Kepenekian, Mikaël; Even, Jacky; Katan, Claudine; Stoumpos, Constantinos C.; Schaller, Richard D.; Kanatzidis, Mercouri G. |
Journal of publication | Journal of the American Chemical Society |
Year of publication | 2019 |
Journal volume | 141 |
Journal issue | 32 |
Pages of publication | 12880 - 12890 |
a | 28.8181 ± 0.001 Å |
b | 9.0332 ± 0.0014 Å |
c | 8.882 ± 0.003 Å |
α | 90° |
β | 94.138 ± 0.009° |
γ | 90° |
Cell volume | 2306.1 ± 0.9 Å3 |
Cell temperature | 298 K |
Ambient diffraction temperature | 298 K |
Number of distinct elements | 5 |
Space group number | 7 |
Hermann-Mauguin space group symbol | P 1 c 1 |
Hall space group symbol | P -2yc |
Residual factor for all reflections | 0.2114 |
Residual factor for significantly intense reflections | 0.1234 |
Weighted residual factors for significantly intense reflections | 0.1619 |
Weighted residual factors for all reflections included in the refinement | 0.1632 |
Goodness-of-fit parameter for significantly intense reflections | 7.07 |
Goodness-of-fit parameter for all reflections included in the refinement | 4.8 |
Diffraction radiation probe | x-ray |
Diffraction radiation wavelength | 0.71013 Å |
Diffraction radiation type | MoKα |