Information card for entry 4127735
Formula | C124 H102 B4 F16 N30 O12 Zn4 |
Calculated formula | C124 H98 B4 F16 N30 O12 Zn4 |
Title of publication | Metal-Organic Capsules with NADH Mimics as Switchable Selectivity Regulators for Photocatalytic Transfer Hydrogenation. |
Authors of publication | Wei, Jianwei; Zhao, Liang; He, Cheng; Zheng, Sijia; Reek, Joost N. H.; Duan, Chunying |
Journal of publication | Journal of the American Chemical Society |
Year of publication | 2019 |
Journal volume | 141 |
Journal issue | 32 |
Pages of publication | 12707 - 12716 |
a | 19.851 ± 0.0008 Å |
b | 19.851 ± 0.0008 Å |
c | 22.6268 ± 0.001 Å |
α | 90° |
β | 90° |
γ | 90° |
Cell volume | 8916.4 ± 0.6 Å3 |
Cell temperature | 200 ± 2 K |
Ambient diffraction temperature | 200 ± 2 K |
Number of distinct elements | 7 |
Space group number | 114 |
Hermann-Mauguin space group symbol | P -4 21 c |
Hall space group symbol | P -4 2n |
Residual factor for all reflections | 0.1055 |
Residual factor for significantly intense reflections | 0.0736 |
Weighted residual factors for significantly intense reflections | 0.1741 |
Weighted residual factors for all reflections included in the refinement | 0.1877 |
Goodness-of-fit parameter for all reflections included in the refinement | 1.082 |
Diffraction radiation wavelength | 0.71073 Å |
Diffraction radiation type | MoKα |