Information card for entry 4127737
Formula | C120 H96 B4 Co4 F16 N28 O12 |
Calculated formula | C120 H92 B4 Co4 F16 N28 O12 |
Title of publication | Metal-Organic Capsules with NADH Mimics as Switchable Selectivity Regulators for Photocatalytic Transfer Hydrogenation. |
Authors of publication | Wei, Jianwei; Zhao, Liang; He, Cheng; Zheng, Sijia; Reek, Joost N. H.; Duan, Chunying |
Journal of publication | Journal of the American Chemical Society |
Year of publication | 2019 |
Journal volume | 141 |
Journal issue | 32 |
Pages of publication | 12707 - 12716 |
a | 19.73 ± 0.0016 Å |
b | 19.73 ± 0.0016 Å |
c | 22.2762 ± 0.0017 Å |
α | 90° |
β | 90° |
γ | 90° |
Cell volume | 8671.5 ± 1.2 Å3 |
Cell temperature | 180 ± 2 K |
Ambient diffraction temperature | 180 ± 2 K |
Number of distinct elements | 7 |
Space group number | 114 |
Hermann-Mauguin space group symbol | P -4 21 c |
Hall space group symbol | P -4 2n |
Residual factor for all reflections | 0.1487 |
Residual factor for significantly intense reflections | 0.0733 |
Weighted residual factors for significantly intense reflections | 0.1712 |
Weighted residual factors for all reflections included in the refinement | 0.1883 |
Goodness-of-fit parameter for all reflections included in the refinement | 1.028 |
Diffraction radiation wavelength | 0.71073 Å |
Diffraction radiation type | MoKα |