Information card for entry 4127756
Formula | C19 H31 B O4 |
Calculated formula | C19 H31 B O4 |
Title of publication | Rhodium(III)-Catalyzed Asymmetric Borylative Cyclization of Cyclohexadienone-Containing 1,6-Dienes: An Experimental and DFT Study. |
Authors of publication | Tan, Yun-Xuan; Zhang, Fang; Xie, Pei-Pei; Zhang, Shuo-Qing; Wang, Yi-Fan; Li, Qing-Hua; Tian, Ping; Hong, Xin; Lin, Guo-Qiang |
Journal of publication | Journal of the American Chemical Society |
Year of publication | 2019 |
Journal volume | 141 |
Journal issue | 32 |
Pages of publication | 12770 - 12779 |
a | 27.671 ± 0.002 Å |
b | 6.9365 ± 0.0006 Å |
c | 10.7712 ± 0.0008 Å |
α | 90° |
β | 100.202 ± 0.004° |
γ | 90° |
Cell volume | 2034.7 ± 0.3 Å3 |
Cell temperature | 296 ± 2 K |
Ambient diffraction temperature | 296 ± 2 K |
Number of distinct elements | 4 |
Space group number | 5 |
Hermann-Mauguin space group symbol | C 1 2 1 |
Hall space group symbol | C 2y |
Residual factor for all reflections | 0.0729 |
Residual factor for significantly intense reflections | 0.0572 |
Weighted residual factors for significantly intense reflections | 0.1513 |
Weighted residual factors for all reflections included in the refinement | 0.1704 |
Goodness-of-fit parameter for all reflections included in the refinement | 1.025 |
Diffraction radiation wavelength | 1.54178 Å |
Diffraction radiation type | CuKα |