Information card for entry 4127771
Formula | C8 H12 N4 O12 |
Calculated formula | C8 H12 N4 O12 |
SMILES | C1CC(C1(CON(=O)=O)CON(=O)=O)(CON(=O)=O)CON(=O)=O |
Title of publication | Impact of Stereo- and Regiochemistry on Energetic Materials. |
Authors of publication | Barton, Lisa M.; Edwards, Jacob T.; Johnson, Eric C.; Bukowski, Eric J.; Sausa, Rosario C.; Byrd, Edward F. C.; Orlicki, Joshua A.; Sabatini, Jesse J.; Baran, Phil S. |
Journal of publication | Journal of the American Chemical Society |
Year of publication | 2019 |
Journal volume | 141 |
Journal issue | 32 |
Pages of publication | 12531 - 12535 |
a | 26.9938 ± 0.0019 Å |
b | 17.3049 ± 0.0009 Å |
c | 6.0736 ± 0.0005 Å |
α | 90° |
β | 90° |
γ | 90° |
Cell volume | 2837.1 ± 0.3 Å3 |
Cell temperature | 296 ± 3 K |
Ambient diffraction temperature | 296 ± 3 K |
Number of distinct elements | 4 |
Space group number | 43 |
Hermann-Mauguin space group symbol | F d d 2 |
Hall space group symbol | F 2 -2d |
Residual factor for all reflections | 0.0326 |
Residual factor for significantly intense reflections | 0.0303 |
Weighted residual factors for significantly intense reflections | 0.0716 |
Weighted residual factors for all reflections included in the refinement | 0.0731 |
Goodness-of-fit parameter for all reflections included in the refinement | 1.084 |
Diffraction radiation probe | x-ray |
Diffraction radiation wavelength | 0.71073 Å |
Diffraction radiation type | MoKα |