Information card for entry 4127773
Formula | C8 H12 N4 O12 |
Calculated formula | C8 H12 N4 O12 |
SMILES | C1(C(CON(=O)=O)C(C1CON(=O)=O)CON(=O)=O)CON(=O)=O |
Title of publication | Impact of Stereo- and Regiochemistry on Energetic Materials. |
Authors of publication | Barton, Lisa M.; Edwards, Jacob T.; Johnson, Eric C.; Bukowski, Eric J.; Sausa, Rosario C.; Byrd, Edward F. C.; Orlicki, Joshua A.; Sabatini, Jesse J.; Baran, Phil S. |
Journal of publication | Journal of the American Chemical Society |
Year of publication | 2019 |
Journal volume | 141 |
Journal issue | 32 |
Pages of publication | 12531 - 12535 |
a | 12.8079 ± 0.0004 Å |
b | 9.3371 ± 0.0003 Å |
c | 12.0047 ± 0.0004 Å |
α | 90° |
β | 95.751 ± 0.003° |
γ | 90° |
Cell volume | 1428.4 ± 0.08 Å3 |
Cell temperature | 298 ± 0.1 K |
Ambient diffraction temperature | 298 ± 0.1 K |
Number of distinct elements | 4 |
Space group number | 15 |
Hermann-Mauguin space group symbol | C 1 2/c 1 |
Hall space group symbol | -C 2yc |
Residual factor for all reflections | 0.0364 |
Residual factor for significantly intense reflections | 0.0337 |
Weighted residual factors for significantly intense reflections | 0.088 |
Weighted residual factors for all reflections included in the refinement | 0.0901 |
Goodness-of-fit parameter for all reflections included in the refinement | 1.096 |
Diffraction radiation probe | x-ray |
Diffraction radiation wavelength | 0.71073 Å |
Diffraction radiation type | MoKα |