Information card for entry 4127777
Formula | C17 H22 Cl N O |
Calculated formula | C17 H22 Cl N O |
SMILES | [Cl-].O(c1ccc([C@H](C)c2ccc([NH+](C)C)cc2)cc1)C |
Title of publication | Nickel-catalyzed Enantioselective Hydroarylation and Hydroalkenylation of Styrenes. |
Authors of publication | Chen, Yue-Gang; Shuai, Bin; Xu, Xue-Tao; Li, Yi-Qian; Yang, Qi-Liang; Qiu, Hui; Zhang, Kun; Fang, Ping; Mei, Tian-Sheng |
Journal of publication | Journal of the American Chemical Society |
Year of publication | 2019 |
Journal volume | 141 |
Journal issue | 8 |
Pages of publication | 3395 - 3399 |
a | 6.4416 ± 0.0003 Å |
b | 10.2487 ± 0.0004 Å |
c | 49.282 ± 0.003 Å |
α | 90° |
β | 90° |
γ | 90° |
Cell volume | 3253.5 ± 0.3 Å3 |
Cell temperature | 293 ± 2 K |
Ambient diffraction temperature | 293 ± 2 K |
Number of distinct elements | 5 |
Space group number | 19 |
Hermann-Mauguin space group symbol | P 21 21 21 |
Hall space group symbol | P 2ac 2ab |
Residual factor for all reflections | 0.1178 |
Residual factor for significantly intense reflections | 0.0811 |
Weighted residual factors for significantly intense reflections | 0.1946 |
Weighted residual factors for all reflections included in the refinement | 0.2244 |
Goodness-of-fit parameter for all reflections included in the refinement | 0.993 |
Diffraction radiation wavelength | 0.71073 Å |
Diffraction radiation type | MoKα |