Information card for entry 4127800
Formula | C15 H28 O |
Calculated formula | C15 H28 O |
SMILES | O[C@@H]1C[C@H](CC=C(CCC[C@@H]1C)C)C(C)C |
Title of publication | Scalable Total Synthesis of (-)-Vinigrol. |
Authors of publication | Yu, Xuerong; Xiao, Lianghong; Wang, Zechun; Luo, Tuoping |
Journal of publication | Journal of the American Chemical Society |
Year of publication | 2019 |
Journal volume | 141 |
Journal issue | 8 |
Pages of publication | 3440 - 3443 |
a | 5.19326 ± 0.00005 Å |
b | 10.12354 ± 0.00009 Å |
c | 25.958 ± 0.0002 Å |
α | 90° |
β | 90° |
γ | 90° |
Cell volume | 1364.72 ± 0.02 Å3 |
Cell temperature | 100 ± 2 K |
Ambient diffraction temperature | 100 ± 2 K |
Number of distinct elements | 3 |
Space group number | 19 |
Hermann-Mauguin space group symbol | P 21 21 21 |
Hall space group symbol | P 2ac 2ab |
Residual factor for all reflections | 0.0311 |
Residual factor for significantly intense reflections | 0.0301 |
Weighted residual factors for significantly intense reflections | 0.0771 |
Weighted residual factors for all reflections included in the refinement | 0.0777 |
Goodness-of-fit parameter for all reflections included in the refinement | 1.061 |
Diffraction radiation probe | x-ray |
Diffraction radiation wavelength | 1.54184 Å |
Diffraction radiation type | CuKα |